{"text_format":"1","workbook":"xlsx","n_sheets":5,"sheets":["MPPT","Modules","Regulator","Calculation table","Language"],"not_rendered":{"charts":2,"images":14,"macros":1,"external_links":0,"defined_names":16,"comments":0,"pivot_tables":0},"unopened":[],"bounds":{"document_bytes":16777216,"sheet_cells":100000,"rows_first":2000,"rows_last":500,"rows_between":2000,"halvings":0,"cell_chars":16384,"cell_head_chars":4096},"cells_cut":0,"cells_raw":0,"read":"whole","date_system":"1900"}

{"sheet":"MPPT","index":0,"n_rows":88,"n_cols":19,"rows_kept":88,"cut":false,"hidden":false,"merged":[[64,8,64,11],[26,10,26,14],[27,10,27,14],[28,10,28,14],[21,10,21,14],[22,10,22,14],[23,10,23,14],[24,10,24,14],[25,10,25,14],[1,6,1,12],[9,10,9,12],[12,10,12,11],[13,10,13,11],[3,5,3,6],[6,5,6,6],[10,3,10,5],[6,10,6,11],[8,10,8,12],[4,3,4,8],[2,3,2,8],[2,10,2,15],[31,4,31,7],[31,12,31,15],[3,12,3,14],[4,10,4,16],[27,3,27,6],[28,3,28,5],[28,6,28,7],[22,3,22,6],[23,3,23,6],[24,3,24,6],[25,3,25,6],[26,3,26,6],[19,3,19,6],[20,3,20,6],[21,3,21,6],[12,5,12,6],[65,12,65,13],[65,14,65,15],[66,9,66,10],[67,9,67,10],[68,9,68,10],[66,12,66,13],[67,12,67,13],[68,12,68,13],[69,9,69,10],[70,9,70,10],[71,9,71,10],[72,9,72,10],[73,9,73,10],[69,12,69,13],[71,14,71,15],[72,14,72,15],[73,14,73,15],[66,14,66,15],[67,14,67,15],[68,14,68,15],[69,14,69,15],[70,14,70,15]]}
[]
[null,null,null,null,null,null,{"$f":"CHOOSE($J$3,INDEX(tab_LANGUAGE[[ENGLISH]:[PORTUGUÊS]],67,_ENGLISH),INDEX(tab_LANGUAGE[[ENGLISH]:[PORTUGUÊS]],67,_DUTCH),INDEX(tab_LANGUAGE[[ENGLISH]:[PORTUGUÊS]],67,_SLOVENSKY),INDEX(tab_LANGUAGE[[ENGLISH]:[PORTUGUÊS]],67,_DEUTSCH),INDEX(tab_LANGUAGE[[ENGLISH]:[PORTUGUÊS]],67,_FRANCAIS),INDEX(tab_LANGUAGE[[ENGLISH]:[PORTUGUÊS]],67,_PORTUGUÊS))","v":"Regulátor nabíjania Blue- & SmartSolar MPPT"}]
[null,null,null,{"$f":"IF(H24=\"N.A.\",\"\",IF('Calculation table'!C49>1.3,CHOOSE($J$3,INDEX(tab_LANGUAGE[[ENGLISH]:[PORTUGUÊS]],39,_ENGLISH),INDEX(tab_LANGUAGE[[ENGLISH]:[PORTUGUÊS]],39,_DUTCH),INDEX(tab_LANGUAGE[[ENGLISH]:[PORTUGUÊS]],39,_SLOVENSKY),INDEX(tab_LANGUAGE[[ENGLISH]:[PORTUGUÊS]],39,_DEUTSCH),INDEX(tab_LANGUAGE[[ENGLISH]:[PORTUGUÊS]],39,_FRANCAIS),INDEX(tab_LANGUAGE[[ENGLISH]:[PORTUGUÊS]],39,_PORTUGUÊS)),\"\"))","v":""},null,null,null,null,null,3,{"$f":"IF(H25=\"N.A.\",\"\",IF('Calculation table'!E50=TRUE,CHOOSE($J$3,INDEX(tab_LANGUAGE[[ENGLISH]:[PORTUGUÊS]],49,_ENGLISH),INDEX(tab_LANGUAGE[[ENGLISH]:[PORTUGUÊS]],49,_DUTCH),INDEX(tab_LANGUAGE[[ENGLISH]:[PORTUGUÊS]],49,_SLOVENSKY),INDEX(tab_LANGUAGE[[ENGLISH]:[PORTUGUÊS]],49,_DEUTSCH),INDEX(tab_LANGUAGE[[ENGLISH]:[PORTUGUÊS]],49,_FRANCAIS),INDEX(tab_LANGUAGE[[ENGLISH]:[PORTUGUÊS]],49,_PORTUGUÊS)),\"\"))","v":""}]
[null,null,null,21,null,{"$f":"CHOOSE($J$3,INDEX(tab_LANGUAGE[[ENGLISH]:[PORTUGUÊS]],1,_ENGLISH),INDEX(tab_LANGUAGE[[ENGLISH]:[PORTUGUÊS]],1,_DUTCH),INDEX(tab_LANGUAGE[[ENGLISH]:[PORTUGUÊS]],1,_SLOVENSKY),INDEX(tab_LANGUAGE[[ENGLISH]:[PORTUGUÊS]],1,_DEUTSCH),INDEX(tab_LANGUAGE[[ENGLISH]:[PORTUGUÊS]],1,_FRANCAIS),INDEX(tab_LANGUAGE[[ENGLISH]:[PORTUGUÊS]],1,_PORTUGUÊS))","v":"Modul:"},null,null,null,null,null,null,{"$f":"CHOOSE($J$3,INDEX(tab_LANGUAGE[[ENGLISH]:[PORTUGUÊS]],9,_ENGLISH),INDEX(tab_LANGUAGE[[ENGLISH]:[PORTUGUÊS]],9,_DUTCH),INDEX(tab_LANGUAGE[[ENGLISH]:[PORTUGUÊS]],9,_SLOVENSKY),INDEX(tab_LANGUAGE[[ENGLISH]:[PORTUGUÊS]],9,_DEUTSCH),INDEX(tab_LANGUAGE[[ENGLISH]:[PORTUGUÊS]],9,_FRANCAIS),INDEX(tab_LANGUAGE[[ENGLISH]:[PORTUGUÊS]],9,_PORTUGUÊS))","v":"Regulátor:"}]
[null,null,null,{"$f":"INDEX(tab_MODUL[Názov],_Modul,1)","v":"CanadianSolar HiKu PERC CS3W 455MS"},null,null,null,null,null,null,{"$f":"INDEX(Regulator!C2:C17,_Regulator,1)","v":"SmartSolar MPPT 250/100 Tr/Tr VE.Can/MC4"}]
[]
[null,null,null,null,null,{"$f":"CHOOSE($J$3,INDEX(tab_LANGUAGE[[ENGLISH]:[PORTUGUÊS]],64,_ENGLISH),INDEX(tab_LANGUAGE[[ENGLISH]:[PORTUGUÊS]],64,_DUTCH),INDEX(tab_LANGUAGE[[ENGLISH]:[PORTUGUÊS]],64,_SLOVENSKY),INDEX(tab_LANGUAGE[[ENGLISH]:[PORTUGUÊS]],64,_DEUTSCH),INDEX(tab_LANGUAGE[[ENGLISH]:[PORTUGUÊS]],64,_FRANCAIS),INDEX(tab_LANGUAGE[[ENGLISH]:[PORTUGUÊS]],64,_PORTUGUÊS))","v":"Počet modulov"},null,null,null,null,{"$f":"CHOOSE($J$3,INDEX(tab_LANGUAGE[[ENGLISH]:[PORTUGUÊS]],10,_ENGLISH),INDEX(tab_LANGUAGE[[ENGLISH]:[PORTUGUÊS]],10,_DUTCH),INDEX(tab_LANGUAGE[[ENGLISH]:[PORTUGUÊS]],10,_SLOVENSKY),INDEX(tab_LANGUAGE[[ENGLISH]:[PORTUGUÊS]],10,_DEUTSCH),INDEX(tab_LANGUAGE[[ENGLISH]:[PORTUGUÊS]],10,_FRANCAIS),INDEX(tab_LANGUAGE[[ENGLISH]:[PORTUGUÊS]],10,_PORTUGUÊS))","v":"Systémové napätie:"},null,{"$f":"INDEX(Q7:Q10,K8,1)","v":48},null,null,2.5,12]
[null,null,null,null,null,null,null,null,null,null,4,null,null,null,null,4,24]
[null,null,null,{"$f":"CHOOSE($J$3,INDEX(tab_LANGUAGE[[ENGLISH]:[PORTUGUÊS]],2,_ENGLISH),INDEX(tab_LANGUAGE[[ENGLISH]:[PORTUGUÊS]],2,_DUTCH),INDEX(tab_LANGUAGE[[ENGLISH]:[PORTUGUÊS]],2,_SLOVENSKY),INDEX(tab_LANGUAGE[[ENGLISH]:[PORTUGUÊS]],2,_DEUTSCH),INDEX(tab_LANGUAGE[[ENGLISH]:[PORTUGUÊS]],2,_FRANCAIS),INDEX(tab_LANGUAGE[[ENGLISH]:[PORTUGUÊS]],2,_PORTUGUÊS))","v":"Do série:"},3,null,{"$f":"CHOOSE($J$3,INDEX(tab_LANGUAGE[[ENGLISH]:[PORTUGUÊS]],3,_ENGLISH),INDEX(tab_LANGUAGE[[ENGLISH]:[PORTUGUÊS]],3,_DUTCH),INDEX(tab_LANGUAGE[[ENGLISH]:[PORTUGUÊS]],3,_SLOVENSKY),INDEX(tab_LANGUAGE[[ENGLISH]:[PORTUGUÊS]],3,_DEUTSCH),INDEX(tab_LANGUAGE[[ENGLISH]:[PORTUGUÊS]],3,_FRANCAIS),INDEX(tab_LANGUAGE[[ENGLISH]:[PORTUGUÊS]],3,_PORTUGUÊS))","v":"Paralelne:"},2,null,null,{"$f":"CHOOSE($J$3,INDEX(tab_LANGUAGE[[ENGLISH]:[PORTUGUÊS]],31,_ENGLISH),INDEX(tab_LANGUAGE[[ENGLISH]:[PORTUGUÊS]],31,_DUTCH),INDEX(tab_LANGUAGE[[ENGLISH]:[PORTUGUÊS]],31,_SLOVENSKY),INDEX(tab_LANGUAGE[[ENGLISH]:[PORTUGUÊS]],31,_DEUTSCH),INDEX(tab_LANGUAGE[[ENGLISH]:[PORTUGUÊS]],31,_FRANCAIS),INDEX(tab_LANGUAGE[[ENGLISH]:[PORTUGUÊS]],31,_PORTUGUÊS))","v":"Dĺžka kábla, modul k MPPT *"},null,null,null,null,6,36]
[null,null,null,null,null,null,null,null,null,null,10,null,null,null,null,10,48]
[null,null,null,{"$f":"CHOOSE($J$3,INDEX(tab_LANGUAGE[[ENGLISH]:[PORTUGUÊS]],4,_ENGLISH),INDEX(tab_LANGUAGE[[ENGLISH]:[PORTUGUÊS]],4,_DUTCH),INDEX(tab_LANGUAGE[[ENGLISH]:[PORTUGUÊS]],4,_SLOVENSKY),INDEX(tab_LANGUAGE[[ENGLISH]:[PORTUGUÊS]],4,_DEUTSCH),INDEX(tab_LANGUAGE[[ENGLISH]:[PORTUGUÊS]],4,_FRANCAIS),INDEX(tab_LANGUAGE[[ENGLISH]:[PORTUGUÊS]],4,_PORTUGUÊS))","v":"Celkový FV výkon @STC:"},null,null,{"$f":"_Serial*_Paralel*INDEX(_Moduls,_Modul,3)","v":2730},{"$f":"CHOOSE($J$3,INDEX(tab_LANGUAGE[[ENGLISH]:[PORTUGUÊS]],5,_ENGLISH),INDEX(tab_LANGUAGE[[ENGLISH]:[PORTUGUÊS]],5,_DUTCH),INDEX(tab_LANGUAGE[[ENGLISH]:[PORTUGUÊS]],5,_SLOVENSKY),INDEX(tab_LANGUAGE[[ENGLISH]:[PORTUGUÊS]],5,_DEUTSCH),INDEX(tab_LANGUAGE[[ENGLISH]:[PORTUGUÊS]],5,_FRANCAIS),INDEX(tab_LANGUAGE[[ENGLISH]:[PORTUGUÊS]],5,_PORTUGUÊS))","v":"Wp"},null,null,null,null,null,null,null,16]
[null,null,null,null,null,null,null,null,null,null,null,null,null,null,null,25]
[null,null,null,null,null,{"$f":"CHOOSE($J$3,INDEX(tab_LANGUAGE[[ENGLISH]:[PORTUGUÊS]],6,_ENGLISH),INDEX(tab_LANGUAGE[[ENGLISH]:[PORTUGUÊS]],6,_DUTCH),INDEX(tab_LANGUAGE[[ENGLISH]:[PORTUGUÊS]],6,_SLOVENSKY),INDEX(tab_LANGUAGE[[ENGLISH]:[PORTUGUÊS]],6,_DEUTSCH),INDEX(tab_LANGUAGE[[ENGLISH]:[PORTUGUÊS]],6,_FRANCAIS),INDEX(tab_LANGUAGE[[ENGLISH]:[PORTUGUÊS]],6,_PORTUGUÊS))","v":"Teplota modulu:"},null,null,null,null,{"$f":"CHOOSE($J$3,INDEX(tab_LANGUAGE[[ENGLISH]:[PORTUGUÊS]],32,_ENGLISH),INDEX(tab_LANGUAGE[[ENGLISH]:[PORTUGUÊS]],32,_DUTCH),INDEX(tab_LANGUAGE[[ENGLISH]:[PORTUGUÊS]],32,_SLOVENSKY),INDEX(tab_LANGUAGE[[ENGLISH]:[PORTUGUÊS]],32,_DEUTSCH),INDEX(tab_LANGUAGE[[ENGLISH]:[PORTUGUÊS]],32,_FRANCAIS),INDEX(tab_LANGUAGE[[ENGLISH]:[PORTUGUÊS]],32,_PORTUGUÊS))","v":"Prierez:"},null,null,null,null,35]
[null,null,null,null,null,"°C","°F",null,null,null,{"$f":"INDEX($P$7:$P$13,$K$15,1)","v":6}]
[null,null,null,null,null,null,null,null,null,null,3]
[null,null,null,{"$f":"CHOOSE($J$3,INDEX(tab_LANGUAGE[[ENGLISH]:[PORTUGUÊS]],7,_ENGLISH),INDEX(tab_LANGUAGE[[ENGLISH]:[PORTUGUÊS]],7,_DUTCH),INDEX(tab_LANGUAGE[[ENGLISH]:[PORTUGUÊS]],7,_SLOVENSKY),INDEX(tab_LANGUAGE[[ENGLISH]:[PORTUGUÊS]],7,_DEUTSCH),INDEX(tab_LANGUAGE[[ENGLISH]:[PORTUGUÊS]],7,_FRANCAIS),INDEX(tab_LANGUAGE[[ENGLISH]:[PORTUGUÊS]],7,_PORTUGUÊS))","v":"Min."},{"$f":"IF(_Temp=1, E17-40&\" °C\", ((E17-40)*9/5)+32& \" °F\")","v":"-15 °C"},null,{"$f":"CHOOSE($J$3,INDEX(tab_LANGUAGE[[ENGLISH]:[PORTUGUÊS]],8,_ENGLISH),INDEX(tab_LANGUAGE[[ENGLISH]:[PORTUGUÊS]],8,_DUTCH),INDEX(tab_LANGUAGE[[ENGLISH]:[PORTUGUÊS]],8,_SLOVENSKY),INDEX(tab_LANGUAGE[[ENGLISH]:[PORTUGUÊS]],8,_DEUTSCH),INDEX(tab_LANGUAGE[[ENGLISH]:[PORTUGUÊS]],8,_FRANCAIS),INDEX(tab_LANGUAGE[[ENGLISH]:[PORTUGUÊS]],8,_PORTUGUÊS))","v":"Max."},{"$f":"IF(_Temp=1, H17&\" °C\", (H17*9/5)+32&\" °F\")","v":"45 °C"}]
[null,null,null,16,25,null,null,45]
[null,null,null,null,null,null,null,null,1,null,null,null,null,null,null,null,false]
[]
[null,null,null,{"$f":"CHOOSE($J$3,INDEX(tab_LANGUAGE[[ENGLISH]:[PORTUGUÊS]],11,_ENGLISH),INDEX(tab_LANGUAGE[[ENGLISH]:[PORTUGUÊS]],11,_DUTCH),INDEX(tab_LANGUAGE[[ENGLISH]:[PORTUGUÊS]],11,_SLOVENSKY),INDEX(tab_LANGUAGE[[ENGLISH]:[PORTUGUÊS]],11,_DEUTSCH),INDEX(tab_LANGUAGE[[ENGLISH]:[PORTUGUÊS]],11,_FRANCAIS),INDEX(tab_LANGUAGE[[ENGLISH]:[PORTUGUÊS]],11,_PORTUGUÊS))","v":"Max. vstupné napätie"},null,null,null,{"$f":"INDEX(_Regulators,_Regulator,7)","v":250},null,null,{"$f":"CHOOSE($J$3,INDEX(tab_LANGUAGE[[ENGLISH]:[PORTUGUÊS]],34,_ENGLISH),INDEX(tab_LANGUAGE[[ENGLISH]:[PORTUGUÊS]],34,_DUTCH),INDEX(tab_LANGUAGE[[ENGLISH]:[PORTUGUÊS]],34,_SLOVENSKY),INDEX(tab_LANGUAGE[[ENGLISH]:[PORTUGUÊS]],34,_DEUTSCH),INDEX(tab_LANGUAGE[[ENGLISH]:[PORTUGUÊS]],34,_FRANCAIS),INDEX(tab_LANGUAGE[[ENGLISH]:[PORTUGUÊS]],34,_PORTUGUÊS))","v":"Sú solárne moduly pokryté snehom väčšinu obdobia v roku?"},null,null,null,null,null,{"$f":"IF($Q$18=TRUE,IF(J3=6,INDEX(Language!B3:G40,35,6),IF(J3=5,INDEX(Language!B3:F37,35,1),IF(J3=6,INDEX(Language!B3:G40,35,6),IF(J3=4,INDEX(Language!B3:F37,35,2),IF(J3=3,INDEX(Language!B3:F37,35,3),IF(J3=2,INDEX(Language!B3:F37,35,4),INDEX(Language!B3:F37,35,5))))))),IF(J3=6,INDEX(Language!B3:G40,36,6),IF(J3=5,INDEX(Language!B3:F38,36,1),IF(J3=4,INDEX(Language!B3:F38,36,2),IF(J3=3,INDEX(Language!B3:F38,36,3),IF(J3=2,INDEX(Language!B3:F38,36,4),INDEX(Language!B3:F38,36,5)))))))","v":"Nie"}]
{"$rows_left_out":69}
{"sheet":"Modules","index":1,"n_rows":48,"n_cols":10,"rows_kept":48,"cut":false,"hidden":false,"merged":[]}
["Názov","Výrobca","Typ","Výkon [W]","Vmpp [V]","Impp [A]","Voc [V]","Isc [A]","V temp coeff [%/°C]","I temp coeff [%/°C]"]
["Žiadny"]
["Victron Energy SPM20-12 (SPM040201200)","Victron Energy","SPM20-12",20,18.5,1.0900000000000001,22.6,1.19,-0.35,0.04]
["Victron Energy SPM30-12 (SPM040301200)","Victron Energy","SPM30-12",30,18.7,1.61,22.87,1.76,-0.34,3.6999999999999998E-2]
["Victron Energy SPM40-12 (SPM040401200)","Victron Energy","SPM40-12",40,18.3,2.19,22.45,2.4,-0.35,0.04]
["Victron Energy SPM55-12 (SPM040551200)","Victron Energy","SPM55-12",55,18.8,2.94,22.9,3.22,-0.35,0.04]
["Victron Energy SPM90-12 (SPM040901200 )","Victron Energy","SPM90-12",90,19.600000000000001,4.59,24.06,5.03,-0.35,0.04]
["Victron Energy SPM115-12 (SPM041151200)","Victron Energy","SPM115-12",115,19,6.04,23.32,6.61,-0.35,0.04]
["Victron Energy SPM175-12 (SPM041751200)","Victron Energy","SPM175-12",175,19.399999999999999,9.0299999999999994,23.7,9.89,-0.35,0.04]
["Victron Energy SPM215-24 (SPM042152400)","Victron Energy","SPM215-24",215,37.4,5.75,45.82,6.3,-0.35,0.04]
["Victron Energy SPM305-20 (SPM043052000)","Victron Energy","SPM305-20",305,32.5,9.3800000000000008,39.700000000000003,10.27,-0.35,0.04]
["Victron Energy SPM360-24 (SPM043602400)","Victron Energy","SPM360-24",360,38.4,9.3800000000000008,47.4,10.24,-0.35,0.04]
["Victron Energy SPP20-12 (SPP040201200)","Victron Energy","SPP20-12",20,18.399999999999999,1.0900000000000001,21.96,1.18,-0.35,0.04]
["Victron Energy SPP30-12 (SPP040301200)","Victron Energy","SPP30-12",30,18.2,1.66,21.8,1.8,-0.35,0.04]
["Victron Energy SPP45-12 (SPP040451200)","Victron Energy","SPP45-12",45,19.100000000000001,2.36,22.9,2.5499999999999998,-0.35,0.04]
["Victron Energy SPP60-12 (SPP040601200)","Victron Energy","SPP60-12",60,19.3,3.12,23.1,3.37,-0.35,0.04]
["Victron Energy SPP90-12 (SPP040901200)","Victron Energy","SPP90-12",90,19.5,4.6100000000000003,23.44,4.9800000000000004,-0.35,0.04]
["Victron Energy SPP115-12 (SPP041151200)","Victron Energy","SPP115-12",115,18.940000000000001,6.08,22.73,6.56,-0.35,0.04]
["Victron Energy SPP175-12 (SPP041751200)","Victron Energy","SPP175-12",175,18.3,9.56,21.9,10.24,-0.35,0.04]
["Victron Energy SPP270-20 (SPP042702000)","Victron Energy","SPP270-20",270,31.7,8.52,38.04,9.2100000000000009,-0.34,4.4999999999999998E-2]
{"$rows_left_out":29}
{"sheet":"Regulator","index":2,"n_rows":20,"n_cols":21,"rows_kept":20,"cut":false,"hidden":false,"merged":[[18,10,18,13]]}
["Názov","Výrobca","Typ","Power @ 12V","Power @ 24V","Power @ 36V","Power @ 48V","Voc max","Voc min","Vmpp min","S. voltage 1","S. voltage 2","S. voltage 3","S. voltage 4","IPV max","Ibat max","Efficiency@12","Efficiency@24","Efficiency@36","Efficiency@48"]
["Victron Energy Blue-/ SmartSolar MPPT 75/10","Victron Energy","Blue-/ SmartSolar MPPT 75/10",135,270,0,0,75,5,1,12,24,"N.A.","N.A.",13,10,0.98,0.98,0,0]
["Victron Energy Blue-/ SmartSolar MPPT 75/15","Victron Energy","Blue-/ SmartSolar MPPT 75/15",200,400,0,0,75,5,1,12,24,"N.A.","N.A.",15,15,0.98,0.98,0,0]
["Victron Energy Blue-/ SmartSolar MPPT 100/15","Victron Energy","Blue-/ SmartSolar MPPT 100/15",200,400,0,0,100,5,1,12,24,"N.A.","N.A.",15,15,0.98,0.98,0,0]
["Victron Energy Blue- /Smart Solar MPPT 100/20","Victron Energy","Blue- /Smart Solar MPPT 100/20",290,580,870,1160,100,5,1,12,24,36,48,20,20,0.98,0.98,0.98,0.98]
["Victron Energy Blue-/ SmartSolar MPPT 100/30","Victron Energy","Blue-/ SmartSolar MPPT 100/30",440,880,0,0,100,5,1,12,24,"N.A.","N.A.",35,30,0.98,0.98,0,0]
["Victron Energy Blue-/ SmartSolar MPPT 100/50","Victron Energy","Blue-/ SmartSolar MPPT 100/50",700,1400,0,0,100,5,1,12,24,"N.A.","N.A.",60,50,0.98,0.98,0,0]
["Victron Energy Blue-/ SmartSolar MPPT 150/35","Victron Energy","Blue-/ SmartSolar MPPT 150/35",500,1000,1500,2000,150,5,1,12,24,36,48,40,35,0.98,0.98,0.98,0.98]
["Victron Energy Blue-/ SmartSolar MPPT 150/45 Tr/MC4","Victron Energy","Blue-/ SmartSolar MPPT 150/45 Tr/MC4",650,1300,1950,2600,150,5,1,12,24,36,48,50,45,0.98,0.98,0.98,0.98]
["Victron Energy Blue-/ SmartSolar MPPT 150/60 Tr/MC4","Victron Energy","Blue-/ SmartSolar MPPT 150/60 Tr/MC4",860,1720,2580,3440,150,5,1,12,24,36,48,50,60,0.98,0.98,0.98,0.98]
["Victron Energy Blue-/ SmartSolar MPPT 150/70 Tr/Tr VE.Can/MC4","Victron Energy","Blue-/ SmartSolar MPPT 150/70 Tr/Tr VE.Can/MC4",1000,2000,3000,4000,150,5,1,12,24,36,48,50,70,0.98,0.98,0.98,0.98]
["Victron Energy SmartSolar MPPT 150/85 Tr/Tr VE.Can/MC4","Victron Energy","SmartSolar MPPT 150/85 Tr/Tr VE.Can/MC4",1200,2400,3600,4900,150,5,1,12,24,36,48,70,85,0.98,0.98,0.98,0.98]
["Victron Energy SmartSolar MPPT 150/100 Tr/Tr VE.Can/MC4","Victron Energy","SmartSolar MPPT 150/100 Tr/Tr VE.Can/MC4",1450,2900,4350,5800,150,5,1,12,24,36,48,70,100,0.98,0.98,0.98,0.98]
["Victron Energy SmartSolar MPPT 250/60 Tr/MC4","Victron Energy","SmartSolar MPPT 250/60 Tr/MC4",860,1720,2580,3440,250,5,1,12,24,36,48,35,60,0.99,0.99,0.99,0.99]
["Victron Energy SmartSolar MPPT 250/70 Tr/Tr VE.Can/MC4","Victron Energy","SmartSolar MPPT 250/70 Tr/Tr VE.Can/MC4",1000,2000,3000,4000,250,5,1,12,24,36,48,35,70,0.99,0.99,0.99,0.99]
["Victron Energy SmartSolar MPPT 250/85 Tr/Tr VE.Can/MC4","Victron Energy","SmartSolar MPPT 250/85 Tr/Tr VE.Can/MC4",1200,2400,3600,4900,250,5,1,12,24,36,48,70,85,0.99,0.99,0.99,0.99]
["Victron Energy SmartSolar MPPT 250/100 Tr/Tr VE.Can/MC4","Victron Energy","SmartSolar MPPT 250/100 Tr/Tr VE.Can/MC4",1450,2900,4350,5800,250,5,1,12,24,36,48,70,100,0.99,0.99,0.99,0.99]
[]
["RS Model","Manufacturer","Type","Power @ 12V","Power @ 24V","Power @ 36V","Power @ 48V","Voc max","Voc min","Vmpp min","System Voltage",null,null,null,"IPV max","Ibat max","Efficiency@12","Efficiency@24","Efficiency@36","Efficiency@48","Itracker"]
[{"$f":"B20&\" \"&C20","v":"Victron Energy SmartSolar MPPT RS 450/100"},"Victron Energy","SmartSolar MPPT RS 450/100",null,null,null,5760,450,120,80,"N.A.","N.A.","N.A.",48,18,100,0,0,0,0.96,70]
{"$rows_left_out":1}
{"sheet":"Calculation table","index":3,"n_rows":50,"n_cols":11,"rows_kept":50,"cut":false,"hidden":false,"merged":[]}
[]
["DATA:"]
[]
["Location:",null,{"$f":"VALUE(LEFT(MPPT!E16,FIND(\" \",MPPT!E16)))","v":-15},"min",{"$f":"MPPT!E16","v":"-15 °C"}]
[null,null,{"$f":"VALUE(LEFT(MPPT!H16,FIND(\" \",MPPT!H16)))","v":45},"max",{"$f":"MPPT!H16","v":"45 °C"}]
[]
["Module info:",null,{"$f":"INDEX(tab_MODUL[[Výrobca]:[I temp coeff '[%/°C']]],_Modul,6)*_Serial","v":147.89999999999998},"Voc @25°C"]
[null,null,{"$f":"INDEX(tab_MODUL[[Výrobca]:[I temp coeff '[%/°C']]],_Modul,4)*_Serial","v":123.89999999999999},"Vmpp @25°C"]
[null,null,{"$f":"INDEX(tab_MODUL[[Výrobca]:[I temp coeff '[%/°C']]],_Modul,7)*_Paralel","v":23.32},"Isc PV@25°C"]
[null,null,{"$f":"INDEX(tab_MODUL[[Výrobca]:[I temp coeff '[%/°C']]],_Modul,5)*_Paralel","v":22.04},"Impp PV @25°C"]
[null,null,{"$f":"$C$10*$C$8/E20","v":56.890749999999997},"Impp output @25°C"]
[null,null,{"$f":"INDEX(tab_MODUL[[Výrobca]:[I temp coeff '[%/°C']]],_Modul,8)","v":-0.26},"Temp. Coeff. Voc"]
[null,null,{"$f":"(C7/100)*C12","v":-0.38453999999999999},"Temp. Coeff. Voc absolute"]
[null,null,{"$f":"INDEX(tab_MODUL[[Výrobca]:[I temp coeff '[%/°C']]],_Modul,9)","v":0.05},"Temp. Coeff. Isc"]
[null,null,{"$f":"C9*(C14/100)","v":1.166E-2},"Temp. Coeff. Isc absolute"]
[null,null,{"$f":"MPPT!G11","v":2730},"Choosen PV power"]
[]
["Regulator info:",null,{"$f":"INDEX(tab_REGULATOR[[Výrobca]:[Efficiency@48]],_Regulator,7)","v":250},"Voc max",{"$f":"INDEX(tab_REGULATOR[[Výrobca]:[Ibat max]],_Regulator,15)","v":100},"Ibat max"]
[null,null,{"$f":"INDEX(tab_REGULATOR[[Výrobca]:[Efficiency@48]],_Regulator,8)+E20","v":53},"Voc min",{"$f":"INDEX(tab_REGULATOR[[Výrobca]:[Ibat max]],_Regulator,14)","v":70},"IPV max"]
[null,null,{"$f":"INDEX(tab_REGULATOR[[Výrobca]:[Efficiency@48]],MPPT!K8,9)+E20","v":49},"Vmpp min",{"$f":"IF(INDEX(MPPT!$Q$7:$Q$10,MPPT!$K$8,1)=\"N.A.\",0,INDEX(MPPT!$Q$7:$Q$10,MPPT!$K$8,1))","v":48},"System voltage",{"$f":"IF(E20=12,16,IF(E20=24,17,IF(E20=36,18,19)))","v":19}]
{"$rows_left_out":31}
{"sheet":"Language","index":4,"n_rows":70,"n_cols":6324,"rows_kept":70,"cut":false,"hidden":false,"merged":[]}
[null,{"$f":"IF(MPPT!J3=1,\"P\",\" \")","v":" "},{"$f":"IF(MPPT!J3=2,\"P\",\" \")","v":" "},{"$f":"IF(MPPT!J3=3,\"P\",\" \")","v":"P"},{"$f":"IF(MPPT!J3=4,\"P\",\" \")","v":" "},{"$f":"IF(MPPT!J3=5,\"P\",\" \")","v":" "},{"$f":"IF(MPPT!J3=6,\"P\",\" \")","v":" "}]
["Pos.","ENGLISH","DUTCH","SLOVENSKY","DEUTSCH","FRANCAIS","PORTUGUÊS"]
[1,"Module:","Paneel:","Modul:","Modul:","Panneau:","Módulo FV"]
[2,"In series:","In serie:","Do série:","In Reihe:","En serie:","Em serie:"]
[3,"Parallel:","Parallel:","Paralelne:","Parallel:","Parallèle:","Em paralelo"]
[4,"Total PV power @STC:","Totale PV vermogen @STC:","Celkový FV výkon @STC:","PV Leistung insgesamt @STC:","Puissance PV totale @STC:","Potência total FV @STC"]
[5,"Wp","Wp","Wp","Wp","Wc","Wp"]
[6,"Module temperature:","Paneel temperatuur:","Teplota modulu:","Modul Temperatur:","Température Paneau:","Temp. módulo FV "]
[7,"Min.","Min.","Min.","Min.","Min.","Min."]
[8,"Max. ","Max.","Max.","Max.","Max.","Max."]
[9,"Controller:","Regelaar:","Regulátor:","Regler:","Régulateur:","Controlador"]
[10,"System voltage:","Systeem spanning:","Systémové napätie:","System Spannung:","Tension du système:","Voltagem do sistema "]
[11,"Max. input voltage","Max. ingangsspanning","Max. vstupné napätie","Max. Eingangspannung:","Tension d'entrée max.:","Voltagem máxima de entrada "]
[12,"Max. PV voltage @ min. temperature","Max. PV spanning @ min. temp.","Max. FV napätie @ min. teplota","Max. PV Spannung @ min. Temp.","PV tension max. @ temp. min.","Voltagem max FV@Temp min "]
[13,"Min. input voltage @ MPP","Min. ingangsspanning @ MPP","Min. vstupné napätie @ MPP","Min. Eingangspannung @ MPP","Tension d'entrée min. @ MPP","Voltagem min. de entrada  @ MPPT"]
[14,"Min. PV voltage @ max. temperature","Min. PV spanning @ max. Temp.","Min. FV napätie @ max. teplota","Min. PV Spannung @ max. Temp.","PV tension min. @ temp. max.","Voltagem min. FV @ Temperatura max."]
[15,"Max. output current","Max. uitgangsstroom","Max. výstupný prúd","Max. Ausgangstrom","Courant de sortie max.","Corrente max. de saida"]
[16,"Max. current @ MPP min. temp.","Max. stroom @ MPP min. temp.","Max. prúd @ MPP min. tepl.","Max. Strom @ MPP min. Temp.","Courant max. @ MPP temp. min.","Corrente max. @ MPPT temp. min."]
[17,"Max. current @ MPP max. temp.","Max. stroom @ MPP max. temp.","Max. prúd @ MPP max. tepl.","Max. Strom @ MPP max. Temp.","Courant max. @ MPP temp. max.","Corrente max. @ MPPT temp. max."]
[18,"Solar module configuration","Zonne-paneel configuratie","Konfigurácia solárneho modulu","Solar Modul Auslegung","Configuration du panneau","Configuração do módulo FV"]
{"$rows_left_out":50}